{"text_format":"1","workbook":"xlsx","n_sheets":6,"sheets":["Anleitung","Anlagenartenkatalog UZH","Anlagenparameter","Eingabe für Planer","Kontrolle für Planer","UsrAnlagen"],"not_rendered":{"charts":0,"images":1,"macros":1,"external_links":0,"defined_names":2,"comments":1,"pivot_tables":0},"unopened":[],"bounds":{"document_bytes":16777216,"sheet_cells":100000,"rows_first":2000,"rows_last":500,"rows_between":2000,"halvings":0,"cell_chars":16384,"cell_head_chars":4096},"cells_cut":0,"cells_raw":0,"read":"whole","date_system":"1900"}

{"sheet":"Anleitung","index":0,"n_rows":28,"n_cols":6,"rows_kept":28,"cut":false,"hidden":false,"merged":[[0,0,1,0]]}
["Anlagenkonzept\n\nZiele\n•\tSchnelle und eindeutige Identifikation der Anlagen in Planon sowie ZLS\n•\tMöglichst effiziente Prozesse, wenig Pflege- und Administrationsaufwand\n•\tDatengrundlage für Instandhaltungsstrategie\n•\tDatengrundlage für Massnahmen- und Instandsetzungsplanung\n•\tDatengrundlage Betriebsoptimierung\n•\tDatengrundlage Risk Based Maintenance\n\nAnleitung für Planer\nVariante 1 mit Makro (nur Windows)\n1.\tBlatt «Eingabe für Planer» öffnen\n2.\tAnlagenfelder von oben nach unten ausfüllen, Beispiele, Erläuterungen sowie Legende der Farbcodes beachten\n3.\tDie erforderlichen (blau markiert) Felder bei der Anmerkung ausfüllen, Beispiele sowie Legende der Farbcodes beachten.\n4.\tMakro ausführen: «Anlage Hinzufügen (Windows!)»\n5.\tFortfahren mit Schritt 2. für nächste Anlage, bis alle Anlagen erfasst sind.\n6.\tBlatt «Kontrolle für Planer» öffnen\n7.\tEingaben kontrollieren.\n\nVariante 2 für eine grosse Anzahl von gleichen Anlagentypen\na)\tSchritte 1. bis und mit 4. der Variante 1 Ausführen, um ein Beispiel für den erforderlichen Anlagentyp zu erhalten.\nb)\tDas erhaltene Beispiel im Blatt \"Kontrolle für Planer\" kopieren, unten einfügen und anpassen (z.B. MSRL-Code, Bezeichnung, Raumkennzeichen, Seriennummer, Anmerkung)."]
[]
["Anleitung zum Ausfüllen vom Blatt \"Importfile CAFM Planon\" - für jede Anlage zu wiederholen"]
["Spalte","Beschreibung","Informationsquelle / Blatt","Hinweis für Planer, um die gelben Felder im \"Importfile CAFM Planon\" auszufüllen","Beispiel","Hinweis UZH intern"]
["A",{"$f":"INDIRECT(\"'UsrAnlagen'!\"&A5&\"9\")","v":"Bezeichnung"},"-","leer lassen"]
["B",{"$f":"INDIRECT(\"'UsrAnlagen'!\"&A6&\"9\")","v":"Code"},"-","MSRL-Code einfügen resp. Anlagen-Code falls kein MSRL-Code vorhanden, siehe Richtlinien zur Bauwerksdokumentation","GLL_C_G201_A001"]
["C",{"$f":"INDIRECT(\"'UsrAnlagen'!\"&A7&\"9\")","v":"Bezeichnung"},"Anlagenartenkatalog UZH, Spalte B","Die Spalte \"C\", \"Bezeichnung\" vom Blatt \"Importfile CAFM Planon\" ist grundsätzlich gleich wie die Beschreibung, aber bei mehreren gleichchnamigen Anlagen ist eine Nummerierung (oder eindeutige Identifikation wie rechts / links) hinzuzufügen z.B. \"Lüftungsanlage 1\" und \"Lüftungsanlage 2\", welche auch auf den Anlagen vor Ort angebracht ist.","Personenlift Nr. 42502790"]
["D",{"$f":"INDIRECT(\"'UsrAnlagen'!\"&A8&\"9\")","v":"Beschreibung"},"Anlagenartenkatalog UZH, Spalte D","Im Blatt \"Anlagenartenkatalog UZH\" steht die Auswahl der \"Anlagentypen\" in Spalte \"D\" zur Auswahl. Es dürfen explizit nur diese Begriffe in dieser Schreibweise in Spalte \"D\" verwendet werden (die Planer können die farblichen Markierungen ignorieren - sie dienen nur internen Zwecken). --> Der Anlagentyp ist im Blatt \"Importfile CAFM Planon\" in Spalte \"D\", \"Beschreibung\" einzufügen.","Personenlift"]
["E",{"$f":"INDIRECT(\"'UsrAnlagen'!\"&A9&\"9\")","v":"Artikelgruppe"},"Anlagenartenkatalog UZH, Spalte A","Die Spalte \"E\", \"Artikelgruppe\" vom Blatt \"Importfile CAFM Planon\" ist mit der entsprechenden \"Code-Gruppe\", Spalte \"A\" vom Blatt \"Anlagenartenkatalog UZH\" einzufügen. (kann mittels SVERWEIS automatisiert werden)","02.09.02"]
["F",{"$f":"INDIRECT(\"'UsrAnlagen'!\"&A10&\"9\")","v":"Hauptanlage"},"-","leer lassen","-"]
["G",{"$f":"INDIRECT(\"'UsrAnlagen'!\"&A11&\"9\")","v":"Einfacher Bestandteil"},"\"True\"","Immer mit \"True\" ausfüllen.","True"]
["H",{"$f":"INDIRECT(\"'UsrAnlagen'!\"&A12&\"9\")","v":"Anmerkung"},"Datenfeldkatalog DC SOF, Spalte C","Restposten - Sofern die Parameter nicht in die Spalten I-U eingetragen werden können: Im \"Datenfeldkatalog DC SOF\" ist in der Spalte \"A\" nach dem Anlagentyp gemäss Bezeichnung zu suchen. Die entsprechenden Parameter gemäss \"Parameterebene\" sind im Importfile, Spalte \"H\" einzufügen. Beispiel: \"Parameterebene\" = \"Druck (Bar)\" --> \"Druck (Bar): 2.3\" einfügen. Bei mehreren Informationen mit einem Absatz aneinanderreihen.","Pikett-Tel.: 044 838 38 38\nStockwerke: 5 / E,F,G,H,J\nStandort Maschinenraum: Geschoss J-401 neben Lift\nTel. Typ: Exicall\nTel Nr.: 044 636 90 12 \nLift ausser Betrieb nehmen bei Netzwerkunterbruch zur Sicherheit: Nein\nRufnummer Sim Karte: 69012","Die grau hinterlegten Begriffe im Blatt \"Datenfeldkatalog\" in der Spalte \"C\", müssen zusätzlich Angegeben werden. \n\nBeispiel Aufzüge: Servicevertrag, Verträge"]
["I",{"$f":"INDIRECT(\"'UsrAnlagen'!\"&A13&\"9\")","v":"Objekt"},"-","Objektkürzel einfügen z.B. \"SOF\"","GLL"]
["J",{"$f":"INDIRECT(\"'UsrAnlagen'!\"&A14&\"9\")","v":"Raum.Objekt"},"-","Objektkürzel einfügen z.B. \"SOF\"","GLL"]
["K",{"$f":"INDIRECT(\"'UsrAnlagen'!\"&A15&\"9\")","v":"Raum.Raumkennzeichen"},"-","Raumkennzeichen (Raumbezeichnung wird anhand Planon definiert)","E-300"]
["L",{"$f":"INDIRECT(\"'UsrAnlagen'!\"&A16&\"9\")","v":"Hersteller /  Marke"},"-",{"$f":"B16","v":"Hersteller /  Marke"},"Gebauer"]
["M",{"$f":"INDIRECT(\"'UsrAnlagen'!\"&A17&\"9\")","v":"Modell / Artikel"},"-",{"$f":"B17","v":"Modell / Artikel"},"Getriebeaufzug"]
["N",{"$f":"INDIRECT(\"'UsrAnlagen'!\"&A18&\"9\")","v":"Seriennummer"},"-",{"$f":"B18","v":"Seriennummer"},"15008703854"]
["O",{"$f":"INDIRECT(\"'UsrAnlagen'!\"&A19&\"9\")","v":"Servicefirma"},"-","Servicefirma","AS Aufzüge AG","Wird anhand der Kreditorennummer definiert"]
["P",{"$f":"INDIRECT(\"'UsrAnlagen'!\"&A20&\"9\")","v":"Inbetriebnahmedatum"},"-",{"$f":"B20","v":"Inbetriebnahmedatum"},"2050-04-30"]
{"$rows_left_out":9}
{"sheet":"Anlagenartenkatalog UZH","index":1,"n_rows":180,"n_cols":6,"rows_kept":180,"cut":false,"hidden":false,"merged":[[10,5,11,5],[12,5,14,5]]}
["Artikelgruppe Nummer (verbindliche Artikelgruppe im Importfile Spalte E)","Artikelgruppe Name","Erläuterung","Anlagetypen (verbindliche Beschreibung im Importfile Spalte D)","Hauptanlage oder Unteranlage?","Bemerkung für die Erfassung der Anlage"]
["01.02.04","Türen, Tore und Abschlüsse ","Sicherheitsrelevante Türen, Tore ","Türe/Tor Fluchtweg","Unteranlage","\"Sicherheitsrelevante Türen/Tore Gruppe\" wird als Hauptanlage je Geschoss aufgenommen, die einzelnen Türen/Tore als Unteranlage.\nTüre/Tor-Nummer ersetzt MSRL-Code"]
["01.02.03","Türen, Tore und Abschlüsse ","Sicherheitsrelevante Türen, Tore ","Türe/Tor Fluchtweg kraftbetätigt","Unteranlage","\"Sicherheitsrelevante Türen/Tore Gruppe\" wird als Hauptanlage je Geschoss aufgenommen, die einzelnen Türen/Tore als Unteranlage.\nTüre/Tor-Nummer ersetzt MSRL-Code"]
["01.02.04","Türen, Tore und Abschlüsse ","Sicherheitsrelevante Türen, Tore ","Türe/Tor Brandschutz","Unteranlage","\"Sicherheitsrelevante Türen/Tore Gruppe\" wird als Hauptanlage je Geschoss aufgenommen, die einzelnen Türen/Tore als Unteranlage.\nTüre/Tor-Nummer ersetzt MSRL-Code"]
["01.02.04","Türen, Tore und Abschlüsse ","Sicherheitsrelevante Türen, Tore ","Türe/Tor Brandschutz kraftbetätigt","Unteranlage","\"Sicherheitsrelevante Türen/Tore Gruppe\" wird als Hauptanlage je Geschoss aufgenommen, die einzelnen Türen/Tore als Unteranlage.\nTüre/Tor-Nummer ersetzt MSRL-Code"]
["01.02.04","Türen, Tore und Abschlüsse ","Sicherheitsrelevante Türen, Tore ","Türe/Tor Fluchtweg Brandschutz","Unteranlage","\"Sicherheitsrelevante Türen/Tore Gruppe\" wird als Hauptanlage je Geschoss aufgenommen, die einzelnen Türen/Tore als Unteranlage.\nTüre/Tor-Nummer ersetzt MSRL-Code"]
["01.02.04","Türen, Tore und Abschlüsse ","Sicherheitsrelevante Türen, Tore ","Türe/Tor Fluchtweg Brandschutz kraftbetätigt","Unteranlage","\"Sicherheitsrelevante Türen/Tore Gruppe\" wird als Hauptanlage je Geschoss aufgenommen, die einzelnen Türen/Tore als Unteranlage.\nTüre/Tor-Nummer ersetzt MSRL-Code"]
["01.02.04","Türen, Tore und Abschlüsse ","Sicherheitsrelevante Türen, Tore ","Türe/Tor kraftbetätigt","Unteranlage","\"Sicherheitsrelevante Türen/Tore Gruppe\" wird als Hauptanlage je Geschoss aufgenommen, die einzelnen Türen/Tore als Unteranlage.\nTüre/Tor-Nummer ersetzt MSRL-Code"]
["01.02.04","Türen, Tore und Abschlüsse ","Nicht sicherheitsrelevante Türen und Tore","Türe/Tor","Unteranlage","\"Nicht sicherheitsrelevante Türen/Tore Gruppe\" wird als Hauptanlage je Geschoss aufgenommen, die einzelnen Türen/Tore als Unteranlage. (nicht zwingend im CAFM zu erfassen)\nTüre/Tor-Nummer ist zu erfassen"]
["01.02.05","Fenster","Fenster sind Lichtdurchlässige Bauelemente welche teilweise geöffnet werden können.","Oblicht","Hauptanlage"]
["01.02.07","Storen- / Beschattungsanlagen","Die Storen- und Beschattungsanlage ist ein System, welches zur Regulierung des Licht- und Wärmeeinfalls dient. Sie kann mit einem elektrischen Motor oder von Hand bedient werden. ","Storenanlage","Hauptanlage","Hydraulische Antriebe für Beschattungsanlage werden nicht separat erfasst - sie gehören zur Beschattungsanlage"]
["01.02.07","Storen- / Beschattungsanlagen","Die Storen- und Beschattungsanlage ist ein System, welches zur Regulierung des Licht- und Wärmeeinfalls dient. Sie kann mit einem elektrischen Motor oder von Hand bedient werden. ","Beschattungsanlage","Hauptanlage"]
["02.00.01","Sicherheitsanlagen","Sicherheitsanlagen sind aktive oder passive Anlagenkomponenten, die technische Anlagen und oder Gebäude für den Menschen sicher machen sollen.","Einbruch- und Überfallmeldeanlage (EMA)","Hauptanlage"," "]
["02.00.01","Sicherheitsanlagen","Sicherheitsanlagen sind aktive oder passive Anlagenkomponenten, die technische Anlagen und oder Gebäude für den Menschen sicher machen sollen.","Evakuationsanlage (SAA und ENS)","Hauptanlage"]
["02.00.01","Sicherheitsanlagen","Sicherheitsanlagen sind aktive oder passive Anlagenkomponenten, die technische Anlagen und oder Gebäude für den Menschen sicher machen sollen.","Befeuerungsanlage","Hauptanlage"]
["02.00.04","Schliessysteme","Ein technisches System zur Steuerung von Schliessmechanismen in Türen oder Toren.","Schlüsseldepot","Hauptanlage"]
["02.01.01","Brandmeldeanlagen","Die Brandmeldeanlage ist ein technisches System bestehend aus mehreren Bauteilen die zusammen die Funktion ergeben einen aufkommenden Brand zu detektieren und automatisch den Blaulichtorganisationen zu melden sowie die Personen vor dem Brand zu Warnen und allenfalls den Fluchtweg an zu zeigen. Das technische System beinhaltet zum Beispiel: Zentrale, Sensoren (Brandmelder), Warnleuchten, Signalhörner, Schnittstellen, Verkabelung.","Brandmeldeanlage (BMA)","Hauptanlage"]
["02.01.02","Brandschutz","Die Brandschutzanlage ist ein technisches System bestehend aus mehreren Bauteilen die zusammen die Funktion ergeben Brandabschnitte automatisch durch Türen und Klappen zu verschliessen um eine Brandausbreitung verhindern zu können.","Brandschutzklappe (BSK)","Hauptanlage","Eine fiktive Hauptanlage pro Haus erstellen, die \"realen\" BSK sind als Unteranlage zu erfassen."]
["02.01.03","Löschanlagen","Die Loeschanlage ist ein technisches System bestehend aus mehreren Bauteilen die zusammen die Funktion ergeben einen Brand in einem Gebäude oder Raum automatisch zu löschen. Es gibt unterschiedliche Löschsysteme, je nach Anforderung an die Löschsubstanz. Das technische System beinhaltet zum Beispiel Steuerung, Löschmittelversorgung, Leitungsnetz, Sensoren, Aktoren.","Sprinkleranlage","Hauptanlage"]
["02.01.03","Löschanlagen","Die Loeschanlage ist ein technisches System bestehend aus mehreren Bauteilen die zusammen die Funktion ergeben einen Brand in einem Gebäude oder Raum automatisch zu löschen. Es gibt unterschiedliche Löschsysteme, je nach Anforderung an die Löschsubstanz. Das technische System beinhaltet zum Beispiel Steuerung, Löschmittelversorgung, Leitungsnetz, Sensoren, Aktoren.","Wasserlöschposten (WLP)","Unteranlage","Wasserlöschposten wird als Unteranlage erfasst , wenn die Hauptanlage eine Gruppe ist. Falls nur ein Wasserlöschposten vorhanden ist, wird er als Hauptanlage erfasst."]
{"$rows_left_out":161}
{"sheet":"Anlagenparameter","index":2,"n_rows":373,"n_cols":11,"rows_kept":373,"cut":false,"hidden":false,"merged":[]}
[]
[null,null,"Anlageart","Anlagetyp","Parameterebene","Feldtyp","Beispiel","Erläuterung",null,{"$f":"'Anlagenartenkatalog UZH'!B1","v":"Artikelgruppe Name"},"Anlagentyp"]
[null,null,"Not- und Augenduschen","Augendusche","Anzahl Anlagen","Zahl",13,null,null,{"$f":"_xlfn._xlws.SORT(_xlfn.UNIQUE('Anlagenartenkatalog UZH'!B2:'Anlagenartenkatalog UZH'!B180))","v":"Abwasser"},{"$f":"_xlfn._xlws.SORT(_xlfn.UNIQUE(IF('Eingabe für Planer'!G4='Anlagenartenkatalog UZH'!B2:B180,'Anlagenartenkatalog UZH'!D2:D180,\"\")))","v":""}]
[null,null,"Not- und Augenduschen","Augendusche","Bemerkung Standort","Text","In Holdecke",null,null,"Aufzüge"]
[null,null,"Wasserverteilung","Aussenwasserhahnen","Frostschutz-\nsicherung vorhanden","Text","Nein",null,null,"Aussenbeleuchtung"]
[null,null,"Wasserverteilung","Aussenwasserhahnen","Anzahl Wartungen pro Jahr","Zahl",1,null,null,"Automationsstationen"]
[null,null,"Wasserverteilung","Aussenwasserhahnen","Standort Abstellhahn","Text","2OG / Maschinenraum",null,null,"Begleitheizungen"]
[null,null,"Aufzüge","Autolift","Anzahl Wartungen pro Jahr","Zahl",2,null,null,"Brandmeldeanlagen"]
[null,null,"Aufzüge","Autolift","Antriebsart","Text","elektrisch",null,null,"Brandschutz"]
[null,null,"Aufzüge","Autolift","BFST über BMA","Text","intern","BFST = Brandfallsteuerung",null,"Brauchwarmwasser"]
[null,null,"Aufzüge","Autolift","E-Alarm /PSA (AlarmierungLeitsystem)","Text","Ja oder Nein",null,null,"Druckgeräte"]
[null,null,"Aufzüge","Autolift","Leitsys.typ.","Text","ZLS",null,null,"Elektroverteilungen (Schaltschränke)"]
[null,null,"Aufzüge","Autolift","Lift ausser Betrieb nehmen\nbei Netzwerkunterbruch\nzur Sicherheit","Text","Ja oder Nein",null,null,"Entrauchung"]
[null,null,"Aufzüge","Autolift","Lift Nr.","Zahl",21023850,null,null,"Fenster"]
[null,null,"Aufzüge","Autolift","Pikett-Tel.","Text","0 848 111 111",null,null,"Gase allgemein"]
[null,null,"Aufzüge","Autolift","Rufnummer SIM Karte","Text",760540956,null,null,"Geräte (Haushalt)"]
[null,null,"Aufzüge","Autolift","Standort Aufzug","Text","2OG / Maschinenraum",null,null,"Heizungsanlage"]
[null,null,"Aufzüge","Autolift","Stützbatteriesteuerung","Text","Ja oder Nein",null,null,"Innenbeleuchtung"]
[null,null,"Aufzüge","Autolift","Tel. Nr.","Zahl","4 44 44","BDI SC Nummer 4 44 44",null,"Kälte"]
[null,null,"Aufzüge","Autolift","Tel. Typ","Text","Exicall ",null,null,"Klimaanlagen"]
{"$rows_left_out":354}
{"sheet":"Eingabe für Planer","index":3,"n_rows":75,"n_cols":10,"rows_kept":75,"cut":false,"hidden":false,"merged":[[2,11,14,11],[0,0,1,25],[17,3,17,6],[3,3,16,3],[2,0,64,2],[18,3,42,3],[2,3,2,4],[2,9,2,10],[8,9,9,10],[10,9,14,10],[2,8,64,8],[4,7,5,7],[6,7,7,7],[43,3,64,7],[15,9,64,11],[8,7,42,7],[6,9,7,10]]}
[]
[]
[null,null,null,"Auszufüllende Felder",null,"Beispiel","Eingabe","Erläuterungen",null,"Legende Farbcodes"]
[null,null,null,"Anlagenfelder","Artikelgruppe Name",{"$f":"G4","v":0},null,"Allgemeine Erläuterung",null,"Erforderte Eingabe"]
[null,null,null,null,"Anlagentyp (Beschreibung)",{"$f":"G5","v":0},null,{"$f":"IFERROR(INDEX(_xlfn._xlws.FILTER('Anlagenartenkatalog UZH'!F2:F180, ('Anlagenartenkatalog UZH'!D2:D180=G5) * ('Anlagenartenkatalog UZH'!B2:B180=G4)), 1), \"\")","v":""},null,"Eingabe Erfolgt"]
[null,null,null,null,"Artikelgruppe",{"$f":"G6","v":"00:00:00"},{"$f":"IFERROR(INDEX(_xlfn._xlws.FILTER('Anlagenartenkatalog UZH'!A:A, ('Anlagenartenkatalog UZH'!D:D=G5) * ('Anlagenartenkatalog UZH'!B:B=G4)), 1), \"\")","v":"00:00:00"},null,null,"Keine Eingabe nötig"]
[null,null,null,null,"MSRL-Code","GLL_C_G201_A001",null,"Erläuterung zur Bezeichnung (allgemeine Erläuterung beachten)\nDie Spalte \"C\", \"Bezeichnung\" ist grundsätzlich gleich wie die Beschreibung, aber bei mehreren gleichchnamigen Anlagen ist eine Nummerierung (oder eindeutige Identifikation wie rechts / links) hinzuzufügen z.B. \"Lüftungsanlage 1\" und \"Lüftungsanlage 2\", welche auch auf den Anlagen vor Ort angebracht ist."]
[null,null,null,null,"Bezeichnung",{"$f":"F5&CHAR(10)&\"+ Identifikation -> siehe Erläuterungen\"","v":"0\n+ Identifikation -> siehe Erläuterungen"}]
[null,null,null,null,"Objekt","GLL",null,null,null,"Das Makro darf nur mit Windows betrieben werden!"]
[null,null,null,null,"Raumkennzeichen","E-300"]
[null,null,null,null,"Hersteller/Marke","Schindler"]
[null,null,null,null,"Modell / Artikel","Getriebeaufzug"]
[null,null,null,null,"Seriennummer",15008703854]
[null,null,null,null,"Servicefirma","AS Aufzüge AG"]
[null,null,null,null,"Inbetriebnahmedatum","2050-04-30"]
[null,null,null,null,"Garantieende","2055-05-01"]
[null,null,null,null,"Erwartetes technisches Enddatum","2075-05-01"]
[null,null,null,"Anmerkung nur ausfüllen wenn die Spalte E dies verlangt!\t\t\t"]
[null,null,null,"Anmerkung",{"$f":"(IF(OR(ISNUMBER(E75),ISTEXT(E75)), E75, \"\"))","v":0},{"$f":"IF(OR(ISNUMBER(G75),ISTEXT(G75)), G75, \"\")","v":0}]
[null,null,null,null,{"$f":"IF(OR(ISNUMBER(E76),ISTEXT(E76)), E76, \"\")","v":""},{"$f":"IF(OR(ISNUMBER(G76),ISTEXT(G76)), G76, \"\")","v":""}]
{"$rows_left_out":56}
{"sheet":"Kontrolle für Planer","index":4,"n_rows":6,"n_cols":15,"rows_kept":6,"cut":false,"hidden":false,"merged":[[2,18,2,31],[0,0,1,17],[0,18,1,18]]}
[]
[]
[null,"Anlagentyp (Beschreibung)","Artikelgruppe","MSRL-Code","Bezeichnung","Objekt","Raumkennzeichen","Hersteller/Marke","Modell / Artikel","Seriennummer","Servicefirma","Inbetriebnahmedatum","Garantieende","Erwartetes technisches Enddatum","Anmerkung"]
[null,{"$f":"'Eingabe für Planer'!G5","v":0},{"$f":"'Eingabe für Planer'!G6","v":0},{"$f":"'Eingabe für Planer'!G7","v":0},{"$f":"'Eingabe für Planer'!G8","v":0},{"$f":"'Eingabe für Planer'!G9","v":0},{"$f":"'Eingabe für Planer'!G10","v":0},{"$f":"'Eingabe für Planer'!G11","v":0},{"$f":"'Eingabe für Planer'!G12","v":0},{"$f":"'Eingabe für Planer'!G13","v":0},{"$f":"'Eingabe für Planer'!G14","v":0},{"$f":"'Eingabe für Planer'!G15","v":"00:00:00"},{"$f":"'Eingabe für Planer'!G16","v":"00:00:00"},{"$f":"'Eingabe für Planer'!G17","v":"00:00:00"},{"$f":"IF('Eingabe für Planer'!E19=\"\",\"\",'Eingabe für Planer'!E19&\": \"&IF('Eingabe für Planer'!G19=\"\",\" ???\",\" \"&'Eingabe für Planer'!G19))&\nCHAR(10)&\nIF('Eingabe für Planer'!E20=\"\",\"\",'Eingabe für Planer'!E20&\": \"&IF('Eingabe für Planer'!G20=\"\",\" ???\",\" \"&'Eingabe für Planer'!G20))&\nCHAR(10)&\nIF('Eingabe für Planer'!E21=\"\",\"\",'Eingabe für Planer'!E21&\": \"&IF('Eingabe für Planer'!G21=\"\",\" ???\",\" \"&'Eingabe für Planer'!G21))&\nCHAR(10)&\nIF('Eingabe für Planer'!E22=\"\",\"\",'Eingabe für Planer'!E22&\": \"&IF('Eingabe für Planer'!G22=\"\",\" ???\",\" \"&'Eingabe für Planer'!G22))&\nCHAR(10)&\nIF('Eingabe für Planer'!E23=\"\",\"\",'Eingabe für Planer'!E23&\": \"&IF('Eingabe für Planer'!G23=\"\",\" ???\",\" \"&'Eingabe für Planer'!G23))&\nCHAR(10)&\nIF('Eingabe für Planer'!E24=\"\",\"\",'Eingabe für Planer'!E24&\": \"&IF('Eingabe für Planer'!G24=\"\",\" ???\",\" \"&'Eingabe für Planer'!G24))&\nCHAR(10)&\nIF('Eingabe für Planer'!E25=\"\",\"\",'Eingabe für Planer'!E25&\": \"&IF('Eingabe für Planer'!G25=\"\",\" ???\",\" \"&'Eingabe für Planer'!G25))&\nCHAR(10)&\nIF('Eingabe für Planer'!E26=\"\",\"\",'Eingabe für Planer'!E26&\": \"&IF('Eingabe für Planer'!G26=\"\",\" ???\",\" \"&'Eingabe für Planer'!G26))&\nCHAR(10)&\nIF('Eingabe für Planer'!E27=\"\",\"\",'Eingabe für Planer'!E27&\": \"&IF('Eingabe für Planer'!G27=\"\",\" ???\",\" \"&'Eingabe für Planer'!G27))&\nCHAR(10)&\nIF('Eingabe für Planer'!E28=\"\",\"\",'Eingabe für Planer'!E28&\": \"&IF('Eingabe für Planer'!G28=\"\",\" ???\",\" \"&'Eingabe für Planer'!G28))&\nCHAR(10)&\nIF('Eingabe für Planer'!E29=\"\",\"\",'Eingabe für Planer'!E29&\": \"&IF('Eingabe für Planer'!G29=\"\",\" ???\",\" \"&'Eingabe für Planer'!G29))&\nCHAR(10)&\nIF('Eingabe für Planer'!E30=\"\",\"\",'Eingabe für Planer'!E30&\": \"&IF('Eingabe für Planer'!G30=\"\",\" ???\",\" \"&'Eingabe für Planer'!G30))&\nCHAR(10)&\nIF('Eingabe für Planer'!E31=\"\",\"\",'Eingabe für Planer'!E31&\": \"&IF('Eingabe für Planer'!G31=\"\",\" ???\",\" \"&'Eingabe für Planer'!G31))&\nCHAR(10)&\nIF('Eingabe für Planer'!E32=\"\",\"\",'Eingabe für Planer'!E32&\": \"&IF('Eingabe für Planer'!G32=\"\",\" ???\",\" \"&'Eingabe für Planer'!G32))&\nCHAR(10)&\nIF('Eingabe für Planer'!E33=\"\",\"\",'Eingabe für Planer'!E33&\": \"&IF('Eingabe für Planer'!G33=\"\",\" ???\",\" \"&'Eingabe für Planer'!G33))&\nCHAR(10)&\nIF('Eingabe für Planer'!E34=\"\",\"\",'Eingabe für Planer'!E34&\": \"&IF('Eingabe für Planer'!G34=\"\",\" ???\",\" \"&'Eingabe für Planer'!G34))&\nCHAR(10)&\nIF('Eingabe für Planer'!E35=\"\",\"\",'Eingabe für Planer'!E35&\": \"&IF('Eingabe für Planer'!G35=\"\",\" ???\",\" \"&'Eingabe für Planer'!G35))&\nCHAR(10)&\nIF('Eingabe für Planer'!E36=\"\",\"\",'Eingabe für Planer'!E36&\": \"&IF('Eingabe für Planer'!G36=\"\",\" ???\",\" \"&'Eingabe für Planer'!G36))&\nCHAR(10)&\nIF('Eingabe für Planer'!E37=\"\",\"\",'Eingabe für Planer'!E37&\": \"&IF('Eingabe für Planer'!G37=\"\",\" ???\",\" \"&'Eingabe für Planer'!G37))&\nCHAR(10)&\nIF('Eingabe für Planer'!E38=\"\",\"\",'Eingabe für Planer'!E38&\": \"&IF('Eingabe für Planer'!G38=\"\",\" ???\",\" \"&'Eingabe für Planer'!G38))&\nCHAR(10)&\nIF('Eingabe für Planer'!E39=\"\",\"\",'Eingabe für Planer'!E39&\": \"&IF('Eingabe für Planer'!G39=\"\",\" ???\",\" \"&'Eingabe für Planer'!G39))&\nCHAR(10)&\nIF('Eingabe für Planer'!E40=\"\",\"\",'Eingabe für Planer'!E40&\": \"&IF('Eingabe für Planer'!G40=\"\",\" ???\",\" \"&'Eingabe für Planer'!G40))&\nCHAR(10)&\nIF('Eingabe für Planer'!E41=\"\",\"\",'Eingabe für Planer'!E41&\": \"&IF('Eingabe für Planer'!G41=\"\",\" ???\",\" \"&'Eingabe für Planer'!G41))&\nCHAR(10)&\nIF('Eingabe für Planer'!E42=\"\",\"\",'Eingabe für Planer'!E42&\": \"&IF('Eingabe für Planer'!G42=\"\",\" ???\",\" \"&'Eingabe für Planer'!G42))","v":"0:  ???\n\n\n\n\n\n\n\n\n\n\n\n\n\n\n\n\n\n\n\n\n\n\n"}]
[]
[null,{"$f":"IF(E19=\"\",\"\",E19& IF(G19=\"\",\" ---\",\" \"&G19))","v":""}]

{"sheet":"UsrAnlagen","index":5,"n_rows":11,"n_cols":21,"rows_kept":11,"cut":false,"hidden":false,"merged":[]}
["Max. Zeichenanzahl Planon","100","255","100","43","100","1","","50","50","15","30","50","50","50","","","","","20",""]
["Obligatorisch","true","false","false","true","false","true","false","false","false","false","false","false","false","false","false","false","false","false","false","false"]
["Einmalig","true","false","false","false","false","false","false","false","false","false","false","false","false","false","false","false","false","false","false","false"]
["Feldtyp","String","String","String","InventoryItemGroup","BaseAsset","Boolean","StringExtended","Property","Property","String","String","String","String","Address","DateNeutral","DateNeutral","DateNeutral","DateNeutral","ServiceContract","DateNeutral"]
["Format","","","","","","","","","","","","","","","YYYY-MM-DD","YYYY-MM-DD","YYYY-MM-DD","YYYY-MM-DD","","YYYY-MM-DD"]
["Teil des Suchbegriffs","true","false","false","false","false","false","false","false","false","false","false","false","false","false","false","false","false","false","false","false"]
["Systemname","Code","Name","Comment","ItemGroupRef","ParentRef","IsSimple","Dossier","PropertyRef","UsrAnlagen.SpaceRef.PropertyRef","UsrAnlagen.SpaceRef.Code","Brand","FreeString63","FreeString66","ServiceCompanyRef","FirstUsedDate","WarrantyExpirationDate","EntryDate","ConstructionDate","FreeInteger2","ExpectedTechnicalEndDate"]
["Standardmäßig verfügbar","true","false","false","false","false","false","false","false","false","","false","false","false","false","false","false","false","false","false","false"]
["Bezeichnung","Code","Bezeichnung","Beschreibung","Artikelgruppe","Hauptanlage","Einfacher Bestandteil","Anmerkung","Objekt","Raum.Objekt","Raum.Raumkennzeichen","Hersteller /  Marke","Modell / Artikel","Seriennummer","Servicefirma","Inbetriebnahmedatum","Garantieende","Datum Erfassung","Herstellungs-/Baudatum","Servicevertrag","Erwartetes technisches Enddatum"]
[null,"GLL-US12-A005","Personenlift Nr. 42502790","Personenlift","2002-09-02",null,"true","Pikett-Tel.: 044 838 38 38\nStockwerke: 5 / E,F,G,H,J\nStandort Maschinenraum: Geschoss J-401 neben Lift\nTel. Typ: Exicall\nTel Nr.: 044 636 90 12\nLift ausser Betrieb nehmen bei Netzwerkunterbruch zur Sicherheit: Nein\nRufnummer Sim Karte: 69012\n","GLL","GLL","E-300","Gebauer","Getriebeaufzug",15008703854,"AS Aufzüge AG","2050-04-30","2055-05-01",null,"2049-05-01",null,"2075-05-01"]
[null,"BOT-§1654199408","Osmoseanlage 607706-01","Osmoseanlage","2004-05-02",null,"true","Vertrag Nr. BWT AG: 994780","BOT","BOT","M2-39","BWT","ELITE OECO 3 DUO","607706-01","Wasser AG","2020-06-30","2025-06-30",null,"2049-05-02",null,"2075-05-02"]